Mt.exe Exited With Error Code 31
Mt.exe Exited With Error Code 31

RECOMMENDED: If you have Windows errors then we strongly recommend that you download and run this (Windows) Repair Tool.

Using process monitor and dbgview I discovered msmpeng (Microsoft Security Essentials) was accessing the file, just when mt.exe wanted to have it exclusively.

Oct 7, 2015. :VCEnd" exited with code 255. C:Program. Error 220 mormerge : error PRJ0019: A tool returned an error code. Error 229. The system cannot find the file specified. mt.exe. Error 372. 31> Generating version number in '.

5): error MSB6006: "mt.exe" exited with code 31. After searching the internet, I found solutions related to manifest file settings in Visual Studio. My problem was solved when I went to the project properties, under Linker then Manifest.

Everything seems ok but when I try to Rsync through the openVPN, I have this result: Code: [email protected]:/tmp/home/root# rsync -avz /tmp/syslog.log [email protected]:/tmp ssh: Exited: Error connecting:.

This error often rears its ugly head when compiling an ASP.NET 2.0 Web Deployment Project. At first glance, it is extremely difficult to troubleshoot because there is not much information along with the error. In order to troubleshoot.

Dec 10 15:52:30 zuroot apache2[31722]: The Apache error log may have more information. Dec 10 15:52:31 zuroot systemd[1]: apache2.service: Control process exited, code=exited status=1 Dec 10 15:52:31 zuroot systemd[1]:.

error MSB6006: "mt.exe" exited with code 31. – by alexmal1. Status : Closed. mt.exe failing with error 31 et al for no obvious reason. Rebuild works fine.

Yes, you are right, this is 32 bits build. And yes, you are correct again – in order to compile x64 binaries just use Visual Studio x64 Win64 Command Prompt (2010).

Jun 5, 2011. This is an error that occurs when you try to build PyCrypto and. insert this line: return 9.0, as following, in this piece of code:.victorjabur.com/python/modules/ pycrypto-2.3.win-amd64-py2.7.exe. 23/11/2014 at 12:31.

Hi, Can you check using tools such as Procmon to see who has an open handle to the executable when mt.exe is running and causing the build to fail.

Version 4.20.4153.1.4. Forgot your password? Click here.

URGENT ACTION REQUIRED. Critical Defect in PostSharp 3.1: process exits with code -199. – See previous warnings for details” With PostShatpHost=Native (typically on build servers): error MSB6006: "postsharp.4.0-x64.exe" exited with code -199 error MSB6006: "postsharp.4.0-x86.exe" exited with code -199.

Not a member of Pastebin yet? Sign Up, it unlocks many cool features!. <RSonja> Error 5758 error MSB6006: "mt.exe" exited with code 31. C:.

Visual Studio Post Build Event MT.exe command fails. (TargetDir)$(TargetName).exe;#1" It is failing with Exited with. Error 46 The command. exited with code.

Oct 8, 2012. If mt.exe is not available on your computer, then the build will fail. Note: mt.exe is not part of the Visual Basic 2010 Express or Visual C# 2010. 2013Bin InventorAddIn1.dll";#2" exited with code 9009. With prevoius template I managed to fix this error by installin SDK onto machine. 27, 28, 29, 30, 31.

Legato Error Message Guide No more missed important software updates! UpdateStar 11 lets you stay up to date and secure with the software on your computer. Zcm Error Impersonating Configured User In this post, I will discuss how to configure a website properly to use impersonation in IIS 7 and. pool crashes on start up with the following error:

I aware of question Fatal error cannot run ‘mt.exe’ at compiling VS 2012 C++ project but I am not satisfied with answer out there. I converted my visual studio.

Error MSB6006: "mt.exe" exited with code 31. just when mt.exe wanted to have it exclusively. the error " MSB6006 mt.exe code 31" happened.

When I try to build VTK on VS 2010, I get this error error MSB6006: "cmd.exe" exited with code 9009. C:Program Files (x86)MSBuildMicrosoft.Cppv4.0Microsoft.

mt.exe exited with error – Das System kann die angegebene Datei nicht. Anbei poste ich euch noch den Code meines Projekts, vielleicht.

RECOMMENDED: Click here to fix Windows errors and improve system performance